กรกฎาคม 19, 2018, 09:04:55 am *
ยินดีต้อนรับคุณ, บุคคลทั่วไป กรุณา เข้าสู่ระบบ หรือ ลงทะเบียน
ส่งอีเมล์ยืนยันการใช้งาน?

เข้าสู่ระบบด้วยชื่อผู้ใช้ รหัสผ่าน และระยะเวลาในเซสชั่น
   หน้าแรก   ช่วยเหลือ เข้าสู่ระบบ สมัครสมาชิก  
หน้า: [1]   ลงล่าง
  พิมพ์  
ผู้เขียน หัวข้อ: error mplax  (อ่าน 549 ครั้ง)
0 สมาชิก และ 1 บุคคลทั่วไป กำลังดูหัวข้อนี้
surasak
Newbie
*
ออฟไลน์ ออฟไลน์

กระทู้: 4


| |
« เมื่อ: พฤศจิกายน 18, 2017, 12:03:50 pm »

สวัสดีครับ ผมได้ทำการย้ายไฟล์โปรเจค mplabx จากคอมเครื่องหนึ่งไปเปิดยังคอมอีกเครื่อง ปรากฎว่า เมื่อคอมไพล์ เกิด error แจ้งเตือนดังรูปด้านล่าง อยากรู้ว่าควรแก้ไขที่ส่วนไหนของโปรแกรม  http://microchipdeveloper.com/faq:45

clcd.c:116: warning: (520) function "_lcdHome" is never called
i2c.c:28: warning: (520) function "_I2C_ReStartCondition" is never called
rtc.c:91: warning: (520) function "_RTC_GetTemperature" is never called
:0: error: (1347) can't find 0x153 words (0x153 withtotal) for psect "text33" in class "CODE" (largest unused contiguous range 0x13B)
:0: error: (1347) can't find 0x112 words (0x112 withtotal) for psect "text14" in class "CODE" (largest unused contiguous range 0x8E)
:0: error: (1347) can't find 0x102 words (0x102 withtotal) for psect "text58" in class "CODE" (largest unused contiguous range 0x8E)
:0: error: (1347) can't find 0xED words (0xed withtotal) for psect "text2" in class "CODE" (largest unused contiguous range 0x8E)
:0: error: (1347) can't find 0x64 words (0x64 withtotal) for psect "text5" in class "CODE" (largest unused contiguous range 0x46)
:0: error: (1347) can't find 0x60 words (0x60 withtotal) for psect "text34" in class "CODE" (largest unused contiguous range 0x46)
:0: error: (1347) can't find 0x5B words (0x5b withtotal) for psect "text51" in class "CODE" (largest unused contiguous range 0x46)
:0: error: (1347) can't find 0x52 words (0x52 withtotal) for psect "text35" in class "CODE" (largest unused contiguous range 0x46)
:0: error: (1347) can't find 0x4D words (0x4d withtotal) for psect "text50" in class "CODE" (largest unused contiguous range 0x46)
:0: error: (1347) can't find 0x4C words (0x4c withtotal) for psect "text21" in class "CODE" (largest unused contiguous range 0x46)
:0: error: (1347) can't find 0x47 words (0x47 withtotal) for psect "text18" in class "CODE" (largest unused contiguous range 0x46)
:0: error: (1347) can't find 0x46 words (0x46 withtotal) for psect "text64" in class "CODE" (largest unused contiguous range 0x31)
:0: error: (1347) can't find 0x3A words (0x3a withtotal) for psect "text37" in class "CODE" (largest unused contiguous range 0x31)
:0: error: (1347) can't find 0x38 words (0x38 withtotal) for psect "text20" in class "CODE" (largest unused contiguous range 0x31)
:0: error: (1347) can't find 0x36 words (0x36 withtotal) for psect "text6" in class "CODE" (largest unused contiguous range 0x31)
:0: error: (1347) can't find 0x36 words (0x36 withtotal) for psect "text61" in class "CODE" (largest unused contiguous range 0x31)
:0: error: (1347) can't find 0x33 words (0x33 withtotal) for psect "text45" in class "CODE" (largest unused contiguous range 0x31)
:0: error: (1347) can't find 0x30 words (0x30 withtotal) for psect "text49" in class "CODE" (largest unused contiguous range 0x28)
:0: error: (1347) can't find 0x2F words (0x2f withtotal) for psect "text47" in class "CODE" (largest unused contiguous range 0x28)
:0: error: (1347) can't find 0x2B words (0x2b withtotal) for psect "text7" in class "CODE" (largest unused contiguous range 0x28)
rror: (1347) can't find 0x24 words (0x24 withtotal) for psect "text22" in class "CODE" (largest unused contiguous range 0x14)
:0: error: (1347) can't find 0x24 words (0x24 withtotal) for psect "text28" in class "CODE" (largest unused contiguous range 0x14)
:0: error: (1347) can't find 0x23 words (0x23 withtotal) for psect "text8" in class "CODE" (largest unused contiguous range 0x14)
:0: error: (1347) can't find 0x23 words (0x23 withtotal) for psect "text29" in class "CODE" (largest unused contiguous range 0x14)
:0: error: (1347) can't find 0x23 words (0x23 withtotal) for psect "text46" in class "CODE" (largest unused contiguous range 0x14)
:0: error: (1347) can't find 0x22 words (0x22 withtotal) for psect "text48" in class "CODE" (largest unused contiguous range 0x14)
:0: error: (1347) can't find 0x20 words (0x20 withtotal) for psect "text16" in class "CODE" (largest unused contiguous range 0x14)
:0: error: (1347) can't find 0x20 words (0x20 withtotal) for psect "text17" in class "CODE" (largest unused contiguous range 0x14)
:0: advisory: (1) too many errors (31)
(908) exit status = 1
nbproject/Makefile-default.mk:307: recipe for target 'dist/default/production/TimerControl.production.hex' failed
make[2]: Leaving directory 'C:/Users/User/Downloads/TimerControl (2)/TimerControl'
nbproject/Makefile-default.mk:90: recipe for target '.build-conf' failed
make[1]: Leaving directory 'C:/Users/User/Downloads/TimerControl (2)/TimerControl'
nbproject/Makefile-impl.mk:39: recipe for target '.build-impl' failed
make[2]: *** [dist/default/production/TimerControl.production.hex] Error 1
make[1]: *** [.build-conf] Error 2
make: *** [.build-impl] Error 2

BUILD FAILED (exit value 2, total time: 3s)
บันทึกการเข้า
ShadowMan
Administrator
Hero Member
*****
ออฟไลน์ ออฟไลน์

เพศ: ชาย
กระทู้: 8272


ShadowWares


| |
« ตอบ #1 เมื่อ: มีนาคม 24, 2018, 05:04:40 pm »

ก่อนและหลังย้าย MCU เป็นเบอร์อะไร และ Compiler เป็น version ไนครับ?
บันทึกการเข้า

By SDW: Do No Wrong Is Do Nothing
          If you want to increase your success rate, double your failure rate
Oriannas
Newbie
*
ออฟไลน์ ออฟไลน์

กระทู้: 2


| |
« ตอบ #2 เมื่อ: เมษายน 27, 2018, 02:30:08 pm »

น่าจะได้แล้วล่ะ
บันทึกการเข้า
หน้า: [1]   ขึ้นบน
  พิมพ์  
 
กระโดดไป: